{"text_format":"1","workbook":"xlsx","n_sheets":12,"sheets":["Disclaimer","INFO","Language","Diagram_NEW","Base_calc","National options","ConvFactors","Method_input","Method_calculation","Method_output","Fmatch","History"],"not_rendered":{"charts":1,"images":52,"macros":1,"external_links":0,"defined_names":15,"comments":6,"pivot_tables":0},"unopened":[],"bounds":{"document_bytes":16777216,"sheet_cells":100000,"rows_first":2000,"rows_last":500,"rows_between":2000,"halvings":0,"cell_chars":16384,"cell_head_chars":4096},"cells_cut":0,"cells_raw":0,"read":"whole","date_system":"1900"}

{"sheet":"Disclaimer","index":0,"n_rows":28,"n_cols":1,"rows_kept":28,"cut":false,"hidden":false,"merged":[]}
["Draft spreadsheet, according to template for all EPB standards "]
["Concerns EPB standard:"]
["ISO/WD 52000-1, Energy performance of buildings — Overarching EPB assessment – Part 1: General framework and procedures"]
[]
[]
["DISCLAIMER:"]
["·         This spreadsheet has been developed in the framework of the preparation and revision of the set of EN or ISO standards on the energy performance of buildings, to support the European \"Energy Performance of Buildings Directive\" recast (EPBD-recast, directive 2010/31/EU). "]
["·         It is meant for use by  CEN and ISO technical committee(s) and the working group(s) working on the preparation or revision of the EPB-standard to which this spreadsheet applies. The spreadsheet supports checking  that all equations in the developed standard are consistent and can be linked with other relevant standards. It is not meant to perform a full or partial energy performance calculation."]
["·         The spreadsheet supports the expert user of the standards, in particular those who want to review the content of the standard and those who want to translate the standard to a software, to understand the correct interpretation of the equations and calculation steps in the standard."]
["·         Although it has been developed with care, neither the technical committee(s), nor the working group(s) and experts related to the EPB- standard to which this spreadsheet applies warrant that the calculations and procedures in this spreadsheet are free of errors. The technical committees as well as the working groups and their respective members expressly disclaim any liability or responsibility arising from use of this spreadsheet, or any consequences thereof. Any responsibility arising from the use of this spreadsheet lies with the user."]
{"$rows_left_out":19}
{"sheet":"INFO","index":1,"n_rows":40,"n_cols":1,"rows_kept":40,"cut":false,"hidden":false,"merged":[]}
["Sheet: INFO"]
["This sheet. It starts with a description of all sheets. Then a simple procedure is given to use the spreadsheet"]
["Sheet: Language"]
["It will contain the strings to have the spreadsheet translated into other languages.\nIt is currently not working. The strings will be updated after completion."]
["Sheet: Diagram new"]
["This sheet displays graphically the values of the needs, input/outputs of generation devices, electric erngy flow.\nThe up/down buttons allow to change the input data of the calculation. This feature works only if the correct base calculation is selected."]
["The display of results will be connected later."]
["Sheet: Base calculation"]
["This sheet contains the definition of the input data to ISO 52001. It acts as an interface to the grphical display in Diagram_New sheet."]
["Three fixed data set can be defined in columns K to M.\nThe \"case shown\" combo at row 6, column C selects which case is used for the calculation in the following sheets.\n The 3 test cases cannot be influenced by the graphic interface.\nThe fourth selection of the combo is the currently displayed case on the graphical interface (sheet Diagram_New)"]
{"$rows_left_out":31}
{"sheet":"Language","index":2,"n_rows":373,"n_cols":15,"rows_kept":373,"cut":false,"hidden":false,"merged":[]}
[]
["CHOOSE LANGUAGE:",null,null,"Language translation table"]
[1]
[{"$f":"+_language-1","v":0},null,null,"English","French","German","Dutch","Greek","Future option","Future option","Future option","Future option","Future option","Future option","Selected text for combo boxes"]
[{"$f":"INDEX(Language!$D$5:$M$5,1,_language)","v":"English"},1,null,"English","Francais","Deutch","Nederlands","Ελληνικά"]
[null,null,null,"Comments","Commentaires","Bemerkungen","Opmerkingen"]
[null,null,null,"energy needs",null,null,"energiebehoefte"]
[null,null,null,"energy use",null,null,"energiegebruik"]
[{"$f":"+D4","v":"English"},null,null,"heating",null,null,"verwarming"]
[{"$f":"+E4","v":"French"},null,null,"hot water",null,null,"warmtapwater"]
{"$rows_left_out":364}
{"sheet":"Diagram_NEW","index":3,"n_rows":58,"n_cols":56,"rows_kept":58,"cut":false,"hidden":false,"merged":[]}
[]
[null,"version:",null,null,null,null,null,null,null,{"$f":"MID(CELL(\"filename\"),SEARCH(\"[\",CELL(\"filename\"))+1, SEARCH(\"]\",CELL(\"filename\"))-SEARCH(\"[\",CELL(\"filename\"))-1)","v":"ISO_DIS_52000-1_SS_2015_05_13.xlsm"},null,null,null,null,null,null,null,null,null,null,null,null,null,null,null,null,null,null,null,null,null,null,null,null,null,null,null,null,null,null,null,null,null,null,null,null,null,null,null,null,null,null,null,null,null,{"$f":"INDEX(Language!D349:M349,1,_language)","v":"Interval to show"}]
[null,null,null,null,null,null,null,null,null,null,null,null,null,null,null,null,null,null,null,null,null,null,null,null,null,null,null,"Displayed time-step",null,null,null,null,null,null,null,null,null,"Heat",null,null,null,null,null,null,null,null,null,null,null,null,null,null,null,null,null,"Total"]
[null,{"$f":"+ConvFactors!B1","v":"Choose your language at sheet \"Language\""},null,null,null,null,null,null,null,null,null,null,null,"<-- Not yet functional",null,null,null,null,null,null,null,null,null,null,null,null,null,null,1,null,null,null,null,null,null,null,null,"Cool",null,null,null,null,null,null,null,null,null,null,null,null,null,null,null,null,null,{"$f":"INDEX(Language!D351:M351,1,_language)","v":"Time-step 1"}]
[null,null,null,null,null,null,null,null,null,null,null,null,null,null,null,null,null,null,null,null,null,null,null,null,null,null,null,null,null,null,null,null,null,null,null,null,null,"Electricity",null,null,null,null,null,null,null,null,null,null,null,null,null,null,null,null,null,{"$f":"INDEX(Language!D352:M352,1,_language)","v":"Time-step 2"}]
[null,null,null,null,null,null,null,null,null,null,null,null,null,null,null,null,null,null,null,null,null,null,null,null,null,null,null,null,null,null,null,null,null,null,null,null,null,null,null,null,null,null,null,null,null,null,null,null,null,null,null,null,null,null,null,{"$f":"INDEX(Language!D353:M353,1,_language)","v":"Time-step 3"}]
[null,{"$f":"+Base_calc!N16","v":1},{"$f":"+Base_calc!J15","v":"Boiler + thermal solar + cooling"},null,null,null,null,null,null,null,null,null,null,null,null,null,null,null,null,null,null,null,null,null,null,null,null,null,null,null,null,null,null,null,null,null,null,null,null,null,null,null,null,null,null,null,null,null,null,null,null,null,null,null,null,{"$f":"INDEX(Language!D354:M354,1,_language)","v":"Time-step 4"}]
[null,null,null,null,null,null,null,null,null,null,null,null,null,null,null,null,null,null,null,null,null,null,null,null,null,null,null,null,null,null,null,null,null,null,null,null,null,null,null,null,null,null,null,null,null,null,null,null,null,null,null,null,null,null,null,{"$f":"INDEX(Language!D355:M355,1,_language)","v":"Time-step 5"}]
[null,null,null,"PRIMARY  ENERGY BALANCE",null,null,null,null,null,null,null,null,null,null,null,null,null,null,null,null,"Primary energy",null,null,null,null,null,null,null,null,null,null,null,null,null,null,null,null,null,null,null,null,null,null,null,null,null,null,null,null,"EPBD services",null,null,null,null,null,{"$f":"INDEX(Language!D356:M356,1,_language)","v":"Time-step 6"}]
[null,null,null,"Conversion factor set:",{"$f":"Base_calc!J935","v":"CEN"},null,null,null,null,null,null,null,null,null,null,null,null,null,null,null,"by generator",null,null,null,null,null,null,null,"Generation subsystems",null,null,null,null,null,"Thermal and electric energy dispatching",null,null,null,null,null,null,null,"Systems, except generation QX,ngen,in)",null,null,null,null,null,null,{"$f":"INDEX(Language!$D$364:$M$364,1,_language)","v":"Building energy needs"},null,null,null,null,null,{"$f":"INDEX(Language!D357:M357,1,_language)","v":"Time-step 7"}]
{"$rows_left_out":49}
{"sheet":"Base_calc","index":4,"n_rows":1349,"n_cols":39,"rows_kept":1349,"cut":false,"hidden":false,"merged":[[8,2,9,2],[174,14,185,14]]}
[null,"Dick van Dijk, TNO (NL)","File name",{"$f":"MID(CELL(\"filename\"),SEARCH(\"[\",CELL(\"filename\"))+1, SEARCH(\"]\",CELL(\"filename\"))-SEARCH(\"[\",CELL(\"filename\"))-1)","v":"ISO_DIS_52000-1_SS_2015_05_13.xlsm"}]
[null,"Laurent Socal"]
[null,{"$f":"INDEX(Language!$D$169:$M$169,1,_language)","v":"Worked out example of"},{"$f":"INDEX(Language!$D$164:$M$164,1,_language)","v":"red: input (unlocked)"}]
[null,{"$f":"INDEX(Language!$D$170:$M$170,1,_language)","v":" full set of equations overall energy performance"},"yellow: input data"]
[null,null,{"$f":"INDEX(Language!$D$166:$M$166,1,_language)","v":"black: calculated using the equations"}]
[null,"CHOOSE LANGUAGE:",{"$f":"INDEX(Language!$D$167:$M$167,1,_language)","v":"Energy unit"},{"$f":"INDEX(AM19:AM20,I6)","v":"kWh"},null,null,null,null,2]
[null,1]
[null,"-- Not yet functional --"]
[null,{"$f":"INDEX(Language!$D$136:$M$136,1,_language)","v":"OK"},{"$f":"INDEX(Language!$D$168:$M$168,1,_language)","v":"Case shown"},null,"<-- \"Calculation  example\" shall be selected "]
[null,null,null,null,null,null,null,"This value shall be 4 to control values via the diagram -->",4]
{"$rows_left_out":1340}
{"sheet":"National options","index":5,"n_rows":61,"n_cols":20,"rows_kept":61,"cut":false,"hidden":false,"merged":[]}
[]
[null,"Choose your language at sheet \"Language\"","<-- Not yet functional"]
[]
[]
[null,"Table A-B.31 - Priority for generation system, export "]
[null,"Please select here the desired priority set",null,null,"Please fill in one column for each priority option set you wish to use"]
[null,"Your selection",1,null,"PV, Wind and CHP are available in this sheet"]
[]
[null,null,null,null,{"$f":"INDEX(Language!$D$106:$N$106,1,_language)","v":"Value"},{"$f":"INDEX(Language!$D$106:$N$106,1,_language)","v":"Value"},{"$f":"INDEX(Language!$D$106:$N$106,1,_language)","v":"Value"},{"$f":"INDEX(Language!$D$106:$N$106,1,_language)","v":"Value"},{"$f":"INDEX(Language!$D$106:$N$106,1,_language)","v":"Value"},{"$f":"INDEX(Language!$D$106:$N$106,1,_language)","v":"Value"},{"$f":"INDEX(Language!$D$106:$N$106,1,_language)","v":"Value"},{"$f":"INDEX(Language!$D$106:$N$106,1,_language)","v":"Value"},{"$f":"INDEX(Language!$D$107:$N$107,1,_language)","v":"Comments"},null,null,null,null,null,"Selection logic - Don't change!"]
[null,"Selected set",{"$f":"INDEX(E10:L10,,_case_priority)","v":"prEN 15603 2015"},null,{"$f":"+ConvFactors!I30","v":"prEN 15603 2015"},{"$f":"+ConvFactors!J30","v":"DIN"},{"$f":"+ConvFactors!K30","v":"EN 15603 : 2008"},{"$f":"+ConvFactors!L30","v":"UNI"},{"$f":"+ConvFactors!M30","v":"DIN no rdel"},{"$f":"+ConvFactors!N30","v":"DIN no exp"},{"$f":"+ConvFactors!O30","v":"DIN exp"},{"$f":"+ConvFactors!P30","v":"Custom"},null,null,"Names are repeated here to have the combo working",null,null,2,1]
{"$rows_left_out":52}
{"sheet":"ConvFactors","index":6,"n_rows":128,"n_cols":21,"rows_kept":128,"cut":false,"hidden":false,"merged":[]}
[null,"Choose your language at sheet \"Language\"","<-- Not yet functional"]
[null,null,"NOTE: weighting supported: primary energy only for now"]
[null,"Table A/B.24 – Energy carrier identifiers and perimeter"]
[null,"Energy carrier","Identifier","Perimeter"]
[null,"Energy carrier description…","Energy carrier identifier","Energy carrier perimeter"]
[null,"gas","gas","dist"]
[null,"oil","oil","dist"]
[null,"coal","coal","dist"]
[null,"wood","wood","dist"]
[null,"biomass","biomass","dist"]
{"$rows_left_out":119}
{"sheet":"Method_input","index":7,"n_rows":131,"n_cols":24,"rows_kept":131,"cut":false,"hidden":false,"merged":[[0,0,0,23]]}
["THIS IS A MANDATORY SHEET\nAll input data for the method shall be listed here.\nIn the simplest version, values for data input in column D (both green and blue background) may be inserted manually.\nVarying data (green background) can be fed from the \"input_series\" sheet.\nIn this sample data sheet, product data (blue background) is linked to a sample catalogue built in the \"Detailed_input\" sheet"]
[]
[]
["Selected example case (see sheet \"Base_calc\"):",null,{"$f":"+Base_calc!J15","v":"Boiler + thermal solar + cooling"}]
["Name","Symbol","Software name","Unit","Row pointer","Col pointer",null,null,null,null,null,"Values",null,null,null,null,null,null,null,"Qualifier","Range","Origin","Varying","Notes"]
["Operating conditions data",null,null,null,"See comment"]
["Time step",null,null,null,"Base_calc","<- data sheet",1,2,3,4,5,6,7,8,9,10,11,12,"TOT",null,null,null,null,"<-- Pointer, do not change these values"]
["Electricity input to the generator i for building service X (or combination of services) during calculation step t","EX,gen,i,in,el,t",null,"kWh",null,null,null,null,null,null,null,null,null,null,null,null,null,null,null,null,"0...∞","Various","Yes"]
[{"$f":"+Base_calc!B349","v":"Heat pump input"},{"$f":"+Base_calc!C349","v":"EHW,HP,in"},null,"kWh",{"$f":"ROW(Base_calc!J349)","v":349},{"$f":"COLUMN(Base_calc!J317)","v":10},{"$f":"IF($T$9=\"el\",INDIRECT(ADDRESS($E9+1,$F9,,,$E$7)),\"\")","v":16.666666666666668},{"$f":"IF($T$9=\"el\",INDIRECT(ADDRESS($E9+1,$F9,,,$E$7)),\"\")","v":16.666666666666668},16.666666666666668,16.666666666666668,16.666666666666668,16.666666666666668,16.666666666666668,16.666666666666668,16.666666666666668,16.666666666666668,16.666666666666668,16.666666666666668,{"$f":"SUM(G9:R9)","v":199.99999999999997},{"$f":"+G10","v":"el"},"0...∞","M3-8-2","Yes","Qualifier: type of use"]
[{"$f":"+Base_calc!B334","v":"Heat pump fuel"},null,null,"n.a",{"$f":"ROW(Base_calc!J334)","v":334},{"$f":"COLUMN(Base_calc!J302)","v":10},{"$f":"INDIRECT(ADDRESS($E10,$F10,,,$E$7))","v":"el"},null,null,null,null,null,null,null,null,null,null,null,null,null,"List","M3-8-2","No","Qualifier: energy carrier"]
{"$rows_left_out":122}
{"sheet":"Method_calculation","index":8,"n_rows":258,"n_cols":23,"rows_kept":258,"cut":false,"hidden":false,"merged":[[243,0,244,0],[0,0,0,20],[230,0,231,0],[232,0,233,0],[234,0,235,0],[236,0,237,0],[147,0,148,0],[137,0,138,0],[152,0,153,0],[149,0,150,0],[139,0,140,0]]}
["THIS IS A MANDATORY SHEET\nOne time step calculation shall be described here.\nFor each calculation step (= 1 row) data for the formula in column D shall be taken from the \"Method_input\" sheet or previous calculation steps.\nInclude in the column \"Formula ref\" its number in the standard text. The example is based on EN 15316-4-1:2008\nCopy and paste a copy of the equation into column \"Formula\"\nUse the column note for information on the calculation"]
[]
["Description","Symbol","Software name","Unit",null,null,null,null,null,"VALUES",null,null,null,null,null,null,null,null,"Formula ref","Formula","Notes"]
["Time step",null,null,null,1,2,3,4,5,6,7,8,9,10,11,12,"TOT","Qualifier"]
[]
[]
["ELECTRICITY USE AND PRODUCTION SUMMARY"]
["Listing all uses by type e.g. \"el\" (main), \"el_aux\", \"el_Joule\", \"el_nEPus\", etc",null,null,null,null,null,null,null,null,null,null,null,null,null,null,null,null,null,null,null,"This distinction  ay be used to select which uses may be covered by on-site electricity production. This feature is not yet implemented in this spreadsheet"]
["Main input to generators","EEPus;el;gen;t",null,"kWh",{"$f":"SUMIF(Method_input!$T$9:$T$30,Method_calculation!$R9,Method_input!G$9:G$30)","v":16.666666666666668},{"$f":"SUMIF(Method_input!$T$9:$T$30,Method_calculation!$R9,Method_input!H$9:H$30)","v":16.666666666666668},{"$f":"SUMIF(Method_input!$T$9:$T$30,Method_calculation!$R9,Method_input!I$9:I$30)","v":16.666666666666668},{"$f":"SUMIF(Method_input!$T$9:$T$30,Method_calculation!$R9,Method_input!J$9:J$30)","v":16.666666666666668},{"$f":"SUMIF(Method_input!$T$9:$T$30,Method_calculation!$R9,Method_input!K$9:K$30)","v":16.666666666666668},{"$f":"SUMIF(Method_input!$T$9:$T$30,Method_calculation!$R9,Method_input!L$9:L$30)","v":16.666666666666668},{"$f":"SUMIF(Method_input!$T$9:$T$30,Method_calculation!$R9,Method_input!M$9:M$30)","v":16.666666666666668},{"$f":"SUMIF(Method_input!$T$9:$T$30,Method_calculation!$R9,Method_input!N$9:N$30)","v":16.666666666666668},{"$f":"SUMIF(Method_input!$T$9:$T$30,Method_calculation!$R9,Method_input!O$9:O$30)","v":16.666666666666668},{"$f":"SUMIF(Method_input!$T$9:$T$30,Method_calculation!$R9,Method_input!P$9:P$30)","v":16.666666666666668},{"$f":"SUMIF(Method_input!$T$9:$T$30,Method_calculation!$R9,Method_input!Q$9:Q$30)","v":16.666666666666668},{"$f":"SUMIF(Method_input!$T$9:$T$30,Method_calculation!$R9,Method_input!R$9:R$30)","v":16.666666666666668},{"$f":"SUM(E9:P9)","v":199.99999999999997},"el","INFO",null,"Main electric input to generators"]
["Auxiliary energy use","EEPus;el;aux;t",null,"kWh",{"$f":"SUMIF(Method_input!$T$9:$T$30,Method_calculation!$R10,Method_input!G$9:G$30)","v":236.46666666666664},{"$f":"SUMIF(Method_input!$T$9:$T$30,Method_calculation!$R10,Method_input!H$9:H$30)","v":196.85},{"$f":"SUMIF(Method_input!$T$9:$T$30,Method_calculation!$R10,Method_input!I$9:I$30)","v":157.19999999999999},{"$f":"SUMIF(Method_input!$T$9:$T$30,Method_calculation!$R10,Method_input!J$9:J$30)","v":117.48333333333333},{"$f":"SUMIF(Method_input!$T$9:$T$30,Method_calculation!$R10,Method_input!K$9:K$30)","v":81.05714285714285},{"$f":"SUMIF(Method_input!$T$9:$T$30,Method_calculation!$R10,Method_input!L$9:L$30)","v":90.228571428571428},{"$f":"SUMIF(Method_input!$T$9:$T$30,Method_calculation!$R10,Method_input!M$9:M$30)","v":95.642857142857139},{"$f":"SUMIF(Method_input!$T$9:$T$30,Method_calculation!$R10,Method_input!N$9:N$30)","v":92.48571428571428},{"$f":"SUMIF(Method_input!$T$9:$T$30,Method_calculation!$R10,Method_input!O$9:O$30)","v":85.771428571428572},{"$f":"SUMIF(Method_input!$T$9:$T$30,Method_calculation!$R10,Method_input!P$9:P$30)","v":125.56666666666666},{"$f":"SUMIF(Method_input!$T$9:$T$30,Method_calculation!$R10,Method_input!Q$9:Q$30)","v":181.03},{"$f":"SUMIF(Method_input!$T$9:$T$30,Method_calculation!$R10,Method_input!R$9:R$30)","v":204.8},1664.5823809523806,"el_aux","INFO",null,"Auxiliary enrgy"]
{"$rows_left_out":249}
{"sheet":"Method_output","index":9,"n_rows":40,"n_cols":21,"rows_kept":40,"cut":false,"hidden":false,"merged":[[0,0,0,23]]}
["THIS IS A MANDATORY SHEET\nOutput of one step calculation shall be indicated here.\nEach cell in the column value shall be a reference to a single cell in the \"Method_calculation\" sheet.\nThe macro will take the calculation step results and fill the values table in the \"Output_series\" sheet."]
[]
[]
["Name","Symbol","Software name","Unit",null,null,null,null,null,"VALUE",null,null,null,null,null,null,null,"Range","Intended destination","Varying","Notes"]
["Time step",null,null,null,1,2,3,4,5,6,7,8,9,10,11,12,"TOT"]
["Total yearly output data"]
["Weighted energy performance","Ewe",null,null,null,null,null,null,null,null,null,null,null,null,null,null,null,"0...∞","M1-4","Yes"]
["Non renewable primary energy","EPnren",null,"kWh",{"$f":"+Method_calculation!E251","v":3636.7874747474752},{"$f":"+Method_calculation!F251","v":2735.0580303030306},{"$f":"+Method_calculation!G251","v":1590.5313645026763},{"$f":"+Method_calculation!H251","v":379.77889055981291},{"$f":"+Method_calculation!I251","v":-711.28003180674955},{"$f":"+Method_calculation!J251","v":-811.60882291029532},{"$f":"+Method_calculation!K251","v":-853.48098001400979},{"$f":"+Method_calculation!L251","v":-729.01604883014249},{"$f":"+Method_calculation!M251","v":-612.88149909014044},{"$f":"+Method_calculation!N251","v":755.36650659756799},{"$f":"+Method_calculation!O251","v":2260.0053636363637},{"$f":"+Method_calculation!P251","v":2849.3430303030304},{"$f":"+Method_calculation!Q251","v":10488.60327799862},"-∞...∞","M1-4","Yes","Non renewable primary energy weighting"]
["Renewable primary energy","EPren",null,"kWh",{"$f":"+Method_calculation!E252","v":118.73272727272726},{"$f":"+Method_calculation!F252","v":134.30939393939394},{"$f":"+Method_calculation!G252","v":236.81027081983839},{"$f":"+Method_calculation!H252","v":372.91622931556799},{"$f":"+Method_calculation!I252","v":500.07287119895682},{"$f":"+Method_calculation!J252","v":569.22314129686913},{"$f":"+Method_calculation!K252","v":576.66589915619352},{"$f":"+Method_calculation!L252","v":517.8557366749435},{"$f":"+Method_calculation!M252","v":415.75179911868656},{"$f":"+Method_calculation!N252","v":269.16708548978283},{"$f":"+Method_calculation!O252","v":174.54539393939396},{"$f":"+Method_calculation!P252","v":148.39939393939392},{"$f":"+Method_calculation!Q252","v":4034.4499421617479},"-∞...∞","M1-4","Yes","Renewable primary energy weighting"]
["Total primary energy","EPtot",null,"kWh",{"$f":"+Method_calculation!E253","v":3755.5202020202023},{"$f":"+Method_calculation!F253","v":2869.3674242424245},{"$f":"+Method_calculation!G253","v":1827.3416353225148},{"$f":"+Method_calculation!H253","v":752.6951198753809},{"$f":"+Method_calculation!I253","v":-211.20716060779273},{"$f":"+Method_calculation!J253","v":-242.38568161342619},{"$f":"+Method_calculation!K253","v":-276.81508085781627},{"$f":"+Method_calculation!L253","v":-211.16031215519899},{"$f":"+Method_calculation!M253","v":-197.12969997145387},{"$f":"+Method_calculation!N253","v":1024.5335920873508},{"$f":"+Method_calculation!O253","v":2434.5507575757574},{"$f":"+Method_calculation!P253","v":2997.7424242424245},{"$f":"+Method_calculation!Q253","v":14523.053220160367},"-∞...∞","M1-4","Yes","Total primary energy weighting"]
{"$rows_left_out":31}
{"sheet":"Fmatch","index":10,"n_rows":43,"n_cols":6,"rows_kept":43,"cut":false,"hidden":false,"merged":[]}
[]
[null,"This is a possible default matching factor function."]
[null,"Perfect match is assumed when production and use are strongly unbalanced"]
[null,"Minimum match is assumed when production and use are the same value"]
[null,"Matching is relative: it is the quota of the minimum of the two."]
[]
[]
[]
[]
[]
{"$rows_left_out":34}
{"sheet":"History","index":11,"n_rows":7,"n_cols":4,"rows_kept":7,"cut":false,"hidden":false,"merged":[]}
[]
[null,"Date","Version scope","Changes, notes"]
[]
[null,"2012-07-04","Issued for discussion in CTL"]
[null,"2012-08-24","Issued for comments in TC 371","Improved readability"]
[null,"2013-02-24","Issued for OA TR","Completed example according to DTR "]
[null,"2015-05-13","Prepared for II Penq","Aligned to ISO DIS 52001-1"]